OBJECTID,���ΐ��Ǘ�,���ݒn,���L��,�ݒu��,���Ǖ��ۖ�,���Y����_,���Y����1,���Y����_1,�擾���@,���ΐ�_��,���ΐ�_�`,���ΐ�_�z,���ΐ�_��,���ΐ�_��,���ΐ�_��,���ΐ�_�G,���ΐ�_��,�h�ΐ���_,�h�ΐ���1,�h�ΐ���_1,�h�ΐ���_2,�h�ΐ���_3,�h�ΐ���_4,�t�ѐݔ�,�ݒu�ꏊ_,�ݒu�ꏊ1,��p����_,��p����1,��p����_1,��p����_2,���ΐ����
1,134308,������3����28��1���t��,����,1973/11/14,���h�{���x�h��,�s�����Y,���p���Y,���h�{��,�ݒu�i��ʍ����j,�O��,�o���n�㎮,200mm,�l�W��,�b,�L,��,,,,,,,,,�s�L�n,���H�i�����j,�s�i�y�؁j,������3����11���ʐ�,1�N,�{�́E������,1
2,134303,������3����13��12���t��,����,1968/12/1,���h�{���x�h��,�s�����Y,���p���Y,���h�{��,�ݒu�i��ʍ����j,�O��,�o���n�㎮,150mm,�l�W��,�b,�L,��,,,,,,,,,�s�L�n,���H�i�����j,�s�i�y�؁j,������3����4���ʐ�,1�N,�{�́E������,1
3,134306,������3����20�ԕt��,����,1971/10/30,���h�{���x�h��,�s�����Y,���p���Y,���h�{��,�ݒu�i��ʍ����j,�O��,�o���n�㎮,150mm,�l�W��,�b,�L,��,,,,,,,,,���L�n,���̑�,,,,,1
4,134311,������3����33�ԕt��,����,1996/9/12,���h�{���x�h��,�s�����Y,���p���Y,���h�{��,�ݒu�i��ʍ����j,�O��,�o���n�㎮,150mm,�l�W��,�b,�L,�L,,,,,,,,,�s�L�n,���H�i�����j,�s�i�y�؁j,������3����12���ʐ�,1�N,�{�́E������,1
5,134312,������3����33�ԕt��,����,1975/12/8,���h�{���x�h��,�s�����Y,���p���Y,���h�{��,�ݒu�i��ʍ����j,�O��,�o���n�㎮,350mm,�l�W��,�b,�L,��,,,,,,,,,�s�L�n,���H�i�����j,�s�i�y�؁j,���E������ʐ�,1�N,�{�́E������,1
6,134403,������4����8��12���t��,����,1983/8/24,���h�{���x�h��,�s�����Y,���p���Y,���h�{��,�ݒu�i��ʍ����j,�O��,�o���n�㎮,150mm,�l�W��,�b,�L,��,,,,,,,,,�s�L�n,���H�i�����j,�s�i�y�؁j,������4����1���ʐ�,1�N,�{�́E������,1
7,134412,������4����35�ԕt��,����,2007/11/13,���h�{���x�h��,�s�����Y,���p���Y,���h�{��,�ݒu�i��ʍ����j,�k��,�P���n�㎮,150mm,�l�W��,�b,�L,�L,������]��,,,,,,,�W��,�s�L�n,���H�i�����j,�s�i�y�؁j,������4����18���ʐ�,1�N,�{�́E�����فE���̑��t�����i�i�W���j,1
8,134511,������5����33��12���t��,����,1974/11/20,���h�{���x�h��,�s�����Y,���p���Y,���h�{��,�ݒu�i��ʍ����j,�O��,�P���n�㎮,100mm,�l�W��,�b,�L,��,,,,,,,,,�s�L�n,���H�i�����j,�s�i�y�؁j,������4����1���ʐ�,1�N,�{�́E������,1
9,134506,������5����18��1���t��,����,1974/3/30,���h�{���x�h��,�s�����Y,���p���Y,���h�{��,�ݒu�i��ʍ����j,�O��,�o���n�㎮,150mm,�l�W��,�b,�L,��,,,,,,,,,�s�L�n,���H�i�����j,�s�i�y�؁j,������5����7���ʐ�,1�N,�{�́E������,1
10,134507,������5����19�ԕt��,����,1975/12/8,���h�{���x�h��,�s�����Y,���p���Y,���h�{��,�ݒu�i��ʍ����j,�O��,�o���n�㎮,150mm,�l�W��,�b,�L,��,,,,,,,,,�s�L�n,���H�i�����j,�s�i�y�؁j,������5����7���ʐ�,1�N,�{�́E������,1
11,134512,������5����38��1���t��,����,1993/12/16,���h�{���x�h��,�s�����Y,���p���Y,���h�{��,�ݒu�i�Ζ���t���j,�O��,�P���n�㎮,75mm,�l�W��,�b,�L,��,,,,,,,,�W��,�s�L�n,���H�i�H���j,�s�i�y�؁j,������5����11���ʐ�,1�N,�{�́E�����فE���̑��t�����i�i�W���j,1
12,134513,������5����40��1���t��,����,1974/11/20,���h�{���x�h��,�s�����Y,���p���Y,���h�{��,�ݒu�i��ʍ����j,�O��,�P���n�㎮,150mm,�l�W��,�b,�L,��,,,,,,,,,�s�L�n,���H�i�����j,�s�i�y�؁j,������5����10���ʐ�,1�N,�{�́E������,1
13,134106,�����䒬1����27��3���t��,����,1976/12/1,���h�{���x�h��,�s�����Y,���p���Y,���h�{��,�ݒu�i��ʍ����j,�O��,�o���n�㎮,150mm,�l�W��,�b,�L,��,,,,,,,,,�s�L�n,���H�i�����j,�s�i�y�؁j,������1����9���ʐ�,1�N,�{�́E������,1
14,134104,������1����12��3���t��,����,1976/12/1,���h�{���x�h��,�s�����Y,���p���Y,���h�{��,�ݒu�i��ʍ����j,�O��,�o���n�㎮,100mm,�l�W��,�b,�L,��,,,,,,,,,�s�L�n,���H�i�����j,�s�i�y�؁j,������1����9���ʐ�,1�N,�{�́E������,1
15,134203,������2����6��1���t��,����,1974/3/30,���h�{���x�h��,�s�����Y,���p���Y,���h�{��,�ݒu�i��ʍ����j,�O��,�o���n�㎮,150mm,�l�W��,�b,�L,��,,,,,,,,�W��,�s�L�n,���H�i�����j,�s�i�y�؁j,������2����21��ʐ�,1�N,�{�́E�����فE���̑��t�����i�i�W���j,1
16,134210,������2����25��1���t��,����,1974/3/30,���h�{���x�h��,�s�����Y,���p���Y,���h�{��,�ݒu�i��ʍ����j,�O��,�o���n�㎮,150mm,�l�W��,�b,�L,��,,,,,,,,,�s�L�n,���H�i�����j,�s�i�y�؁j,������2����16���ʐ�,1�N,�{�́E������,1
17,234402,������4����37��6���t��,����,1979/11/20,���h�{���x�h��,�s�����Y,���p���Y,���h�{��,�ݒu�i�Ζ���t���j,,�n�����i���ٖ��j,100mm,�l�W��,��,�L,��,,,,,,,,�W��,�s�L�n,���H�i�ԓ��j,�s�i�y�؁j,������4����15��ʐ�,1�N,�{�́E�����فE���̑��t�����i�i�W���j,2
18,234501,������5����13��15���t��,����,1968/11/1,���h�{���x�h��,�s�����Y,���p���Y,���h�{��,�ݒu�i��ʍ����j,,�n�����i���ٖ��j,150mm,�l�W��,��,�L,��,,,,,,,,,�s�L�n,���H�i�ԓ��j,�s�i�y�؁j,������5����5��ʐ�,1�N,�{�́E������,2
19,421201,�w����2����9��20���t��,����,1979/3/26,���h�{���x�h��,�s�����Y,���p���Y,���h�{��,�ݒu�i�Ζ���t���j,,,,,,,,,�R���N���[�g��,40t,�L,��,��,1,�W��,�s�L�n,���H�i�ԓ��j,�s�i�y�؁j,�w����2����3��ʐ�,1�N,�{�́E�����فE���̑��t�����i�i�W���j,4
20,521405,�w����4���ڕt��,���̑�,,���h�{���x�h��,�s�����Y,���p���Y,���h�{��,,,,,,,,,,,,,,,,,,,,,,,5
21,521205,�w����2����8�ԕt��,���̑�,,���h�{���x�h��,�s�����Y,���p���Y,���h�{��,,,,,,,,,,,,,,,,,,,,,,,5
22,516003,��璬249�Ԓn�t��,���̑�,,���h�{���x�h��,�s�����Y,���p���Y,���h�{��,,,,,,,,,,,,,,,,�W��,,,,,,,5
23,516002,��璬211�Ԓn�t��,���̑�,,���h�{���x�h��,�s�����Y,���p���Y,���h�{��,,,,,,,,,,,,,,,,�W��,,,,,,,5
24,501003,�ΐ쒬284�Ԓn�t��,���̑�,,���h�{���x�h��,�s�����Y,���p���Y,���h�{��,,,,,,,,,,,,,,,,�W��,,,,,,,5
25,122114,������1����57�ԕt��,����,2005/12/16,���h�{���x�h��,�s�����Y,���p���Y,���h�{��,��t,�O��,�o���n�㎮,100mm,�l�W��,�b,�L,�L,,,,,,,,,�s�L�n,���H�i�����j,�s�i�y�؁j,������1����1���ʐ�,1�N,�{�́E������,1
26,122301,������3����2�ԕt��,����,2005/5/18,���h�{���x�h��,�s�����Y,���p���Y,���h�{��,�ݒu�i��ʍ����j,�k��,�o���n�㎮,150mm,�l�W��,�b,�L,�L,������]��,,,,,,,�W��,�s�L�n,���H�i�����j,�s�i�y�؁j,�{�̐X�����ʂ�@�������R���ڂP���ʐ�,1�N,�{�́E�����فE���̑��t�����i�i�W���j,1
27,122304,������3����11�ԕt��,����,2002/11/25,���h�{���x�h��,�s�����Y,���p���Y,���h�{��,�ݒu�i��ʍ����j,�k��,�P���n�㎮,100mm,�l�W��,�b,�L,�L,������]��,,,,,,,�W��,�s�L�n,���H�i�����j,�s�i�y�؁j,,1�N,�{�́E�����فE���̑��t�����i�i�W���j,1
28,122405,������4����13�ԕt��,����,1969/10/1,���h�{���x�h��,�s�����Y,���p���Y,���h�{��,�ݒu�i��ʍ����j,�O��,�o���n�㎮,150mm,�l�W��,�b,�L,��,,,,,,,,�h���,�s�L�n,���H�i�H���j,�s�i�y�؁j,������4����2��ʐ�,1�N,�{�́E�����فE���̑��t�����i�i�h���j,1
29,122408,������4����28�ԕt��,����,1972/1/15,���h�{���x�h��,�s�����Y,���p���Y,���h�{��,�ݒu�i��ʍ����j,�O��,�o���n�㎮,150mm,�l�W��,�b,�L,��,,,,,,,,,�s�L�n,���H�i�����j,�s�i�y�؁j,������4����6��ʐ��@,1�N,�{�́E������,1
30,122210,������2����33�ԕt��,����,2001/8/6,���h�{���x�h��,�s�����Y,���p���Y,���h�{��,�ݒu�i��ʍ����j,�k��,�P���n�㎮,100mm,�l�W��,�b,�L,�L,������]��,,,,,,,�W��,�s�L�n,���H�i�H���j,�s�i�y�؁j,������2����14���ʐ�,1�N,�{�́E�����فE���̑��t�����i�i�W���j,1
31,145005,������15�ԕt��,����,1965/1/15,���h�{���x�h��,�s�����Y,���p���Y,���h�{��,�ݒu�i��ʍ����j,�O��,�o���n�㎮,100mm,�l�W��,�b,�L,�L,,,,,,,,�W��,�s�L�n,���H�i�ԓ��j,�s�i�y�؁j,�����c�n4���ʐ�,1�N,�{�́E�����فE���̑��t�����i�i�W���j,1
32,145010,������46�ԕt��,����,1974/5/8,���h�{���x�h��,�s�����Y,���p���Y,���h�{��,�ݒu�i��ʍ����j,�O��,�o���n�㎮,150mm,�l�W��,�b,��,��,,,,,,,,�h���,�s�L�n,���H�i�ԓ��j,�s�i�y�؁j,��������2���ʐ�,1�N,�{�́E���̑��t�����i�i�h���j,1
33,128001,�V�_��7�ԕt��,����,1973/6/13,���h�{���x�h��,�s�����Y,���p���Y,���h�{��,�ݒu�i��ʍ����j,�O��,�o���n�㎮,100mm,�l�W��,�b,��,��,,,,,,,,,�s�L�n,���H�i�ԓ��j,�s�i�y�؁j,�V�_��7���ʐ�,1�N,�{��,1
34,126401,�m���ʒ�4���ڕt��,����,1975/4/1,���h�{���x�h��,�s�����Y,���p���Y,���h�{��,�ڊ�,����,�P���n�㎮,100mm,�l�W��,�b,��,��,,,,,,,,,���L�n,���H�i�H���j,,,,,1
35,222304,������3����11�ԕt��,����,1972/3/21,���h�{���x�h��,�s�����Y,���p���Y,���h�{��,�ݒu�i��ʍ����j,,�n�����i���ٖ��j,100mm,�l�W��,�b,�L,��,,,,,,,,�W��,�s�L�n,���H�i�����j,�s�i�y�؁j,���������ʐ�,1�N,�{�́E�����فE���̑��t�����i�i�W���j,2
36,145017,������62�ԕt��,����,1993/12/13,���h�{���x�h��,�s�����Y,���p���Y,���h�{��,�ڊ�,�k�쎮,�P���n�㎮,150mm,�l�W��,C,�L,�L,������]��,,,,,,,�W��,�s�L�n,���H�i�����j,�s�i�y�؁j,�����c�n�ʐ�,1�N,�{�́E���̑��t�����i�i�W���j,1
37,428001,�V�_��26��12���t��,����,1972/7/24,���h�{���x�h��,�s�����Y,���p���Y,���h�{��,�ڊ�,,,,,,,,,�R���N���[�g��,40t,��,��,��,1,�W��,�s�L�n,�͐�~�n��,�s�i�y�؁j,�m���ʐ�,10�N,�{�́E���̑��t�����i�i�W���j,4
38,345001,������12�ԕt��,�r�D��,1989/12/1,���h�{���x�h��,�s�����Y,���p���Y,���h�{��,,,�n�����i���ٗL�j,100mm,�l�W��,��,��,��,,,,,,,,�W��,,���H�i�����j,,,,,3
39,645502,������37�ԕt��,����,2006/7/21,���h�{���x�h��,�s�����Y,���p���Y,���h�{��,,�k��,�P���n�㎮,150mm,�l�W��,�b,�L,�L,������]��,,,,,,,�W��,���L�n,�w�Z�~�n��,,,,,6
40,645504,������27�ԕt��,����,1997/4/11,���h�{���x�h��,�s�����Y,���p���Y,���h�{��,,���X,�o���n�㎮,200mm,�l�W��,�b,�L,�L,�l�I�����t�F,,,,,,,,���L�n,�w�Z�~�n��,,,,,6
41,149202,�{�֐���2����24��1���t��,����,2003/12/22,���h�{���x�h��,�s�����Y,���p���Y,���h�{��,�ݒu�i��ʍ����j,�k��,�P���n�㎮,100mm,�l�W��,�b,�L,�L,������]��,,,,,,,�W��,���L�n,���H�i�H���j,,,,,1
42,149305,�{�֐���3����38��5���t��,����,2004/7/23,���h�{���x�h��,�s�����Y,���p���Y,���h�{��,�ݒu�i��ʍ����j,�k��,�P���n�㎮,150mm,�l�W��,�b,�L,�L,������]��,,,,,,,�W��,�s�L�n,���H�i�H���j,�s�i�y�؁j,�{�֐��{���ʐ�,1�N,�{�́E�����فE���̑��t�����i�i�W���j,1
43,103210,�G�ے�2����22�ԕt��,����,2006/12/22,���h�{���x�h��,�s�����Y,���p���Y,���h�{��,�ݒu�i�Ζ���t���j,�k��,�P���n�㎮,150mm,�l�W��,C,�L,�L,������]��,,,,,,,�W��,���L�n,���̑�,,,,,1
44,103204,�G�ے�2����22�ԕt��,����,1997/1/7,���h�{���x�h��,�s�����Y,���p���Y,���h�{��,�ݒu�i�Ζ���t���j,�O��,�P���n�㎮,150mm,�l�W��,C,�L,�L,,,,,,,,�W��,�s�L�n,���H�i�H���j,�s�i�y�؁j,�G�ے�2����20���ʐ�,1�N,�{�́E�����فE���̑��t�����i�i�W���j,1
45,103202,�G�ے�2����5��7���t��,����,1976/3/19,���h�{���x�h��,�s�����Y,���p���Y,���h�{��,�ݒu�i��ʍ����j,�k��,�P���n�㎮,100mm,�l�W��,C,�L,�L,������]��,,,,,,,�W��,�s�L�n,���H�i�H���j,�s�i�y�؁j,�G�ے�2����1���ʐ�,1�N,�{�́E�����فE���̑��t�����i�i�W���j,1
46,119209,�j�Ò�2����18�ԕt��,����,2001/12/27,���h�{���x�h��,�s�����Y,���p���Y,���h�{��,��t,�k��,�P���n�㎮,200mm,�l�W��,C,�L,�L,������]��,,,,,,,�W���E�h���,�s�L�n,���̑�,,,,,1
47,110103,�`�쒬1����19��3���t��,����,2008/3/31,���h�{���x�h��,�s�����Y,���p���Y,���h�{��,�ݒu�i��ʍ����j,�k��,�o���n�㎮,300mm,�l�W��,C,�L,��,������]��,,,,,,,�W��,�s�L�n,���H�i�����j,�s�i�y�؁j,�`��G�ےʐ�,1�N,�{�́E�����فE���̑��t�����i�i�W���j,1
48,110106,�`�쒬1����6�ԕt��,����,2007/9/27,���h�{���x�h��,�s�����Y,���p���Y,���h�{��,�ݒu�i��ʍ����j,�k��,�P���n�㎮,150mm,�l�W��,C,�L,�L,������]��,,,,,,,�W��,���L�n,���H�i�����j,���i�y���j,�����`��,5�N,�{�́E�����فE���̑��t�����i�i�W���j,1
49,110204,�`�쒬2����13�ԕt��,����,1984/10/24,���h�{���x�h��,�s�����Y,���p���Y,���h�{��,�ݒu�i��ʍ����j,�O��,�o���n�㎮,75mm,�l�W��,C,�L,��,,,,,,,,,�s�L�n,���H�i�H���j,�s�i�y�؁j,�`�쒬2����6���ʐ�,1�N,�{�́E������,1
50,143103,���s��1����8�ԕt��,����,1997/1/7,���h�{���x�h��,�s�����Y,���p���Y,���h�{��,�ݒu�i�Ζ���t���j,�O��,�o���n�㎮,100mm,�l�W��,C,�L,�L,,,,,,,,�W��,���L�n,���H�i�H���j,���i�y���j,�j�Ð����H������,5�N,�{�́E�����فE���̑��t�����i�i�W���j,1
51,149303,�{�֐���3����16�ԕt��,����,2009/3/16,���h�{���x�h��,�s�����Y,���p���Y,���h�{��,�ݒu�i��ʍ����j,�k��,�o���n�㎮,100mm,�l�W��,�b,�L,�L,������]��,,,,,,,�W��,�s�L�n,���H�i�����j,�s�i�y�؁j,�{�֐������ʐ�,1�N,�{�́E���̑��t�����i�i�W���j,1
52,111302,�`�k��3����5��7���t��,����,1983/12/5,���h�{���x�h��,�s�����Y,���p���Y,���h�{��,�ݒu�i��ʍ����j,�O��,�o���n�㎮,250mm,�l�W��,�b,�L,��,,,,,,,,,�s�L�n,���H�i�����j,�s�i�y�؁j,�`�k��3����1���ʐ�,1�N,�{�́E������,1
53,111107,�`�k��1����2�ԕt��,����,1998/10/30,���h�{���x�h��,�s�����Y,���p���Y,���h�{��,��t,�k��,�P���n�㎮,100mm,�l�W��,�b,�L,��,,,,,,,,�W��,�s�L�n,���H�i�����j,�s�i�y�؁j,�`�k��1����11���ʐ�,1�N,�{�́E�����فE���̑��t�����i�i�W���j,1
54,108003,���ؒ�14�ԕt��,����,1976/12/1,���h�{���x�h��,�s�����Y,���p���Y,���h�{��,�ݒu�i��ʍ����j,�O��,�o���n�㎮,100mm,�l�W��,�b,�L,��,,,,,,,,�W��,�s�L�n,���H�i�����j,�s�i�y�؁j,���ؒ����ʐ�,1�N,�{�́E�����فE���̑��t�����i�i�W���j,1
55,108005,���ؒ�22�ԕt��,����,1992/11/25,���h�{���x�h��,�s�����Y,���p���Y,���h�{��,�ݒu�i�Ζ���t���j,�O��,�o���n�㎮,150mm,�l�W��,�b,�L,��,,,,,,,,�W��,�s�L�n,���H�i�����j,�s�i�y�؁j,���ؒ����ʐ�,1�N,�{�́E�����فE���̑��t�����i�i�W���j,1
56,108004,���ؒ�11��2���t��,����,1989/12/27,���h�{���x�h��,�s�����Y,���p���Y,���h�{��,�ݒu�i�Ζ���t���j,�O��,�o���n�㎮,150mm,�l�W��,�b,�L,��,,,,,,,,�W��,�s�L�n,���H�i�H���j,�s�i�y�؁j,���ؒ�2��ʐ�,1�N,�{�́E�����فE���̑��t�����i�i�W���j,1
57,108010,���ؒ�51�ԕt��,����,1985/8/19,���h�{���x�h��,�s�����Y,���p���Y,���h�{��,�ݒu�i��ʍ����j,�O��,�P���n�㎮,75mm,�l�W��,�b,�L,��,,,,,,,,�W��,�s�L�n,���H�i�����j,�s�i�y�؁j,���ؒ�12��ʐ�,1�N,�{�́E�����فE���̑��t�����i�i�W���j,1
58,152405,������4����17��16���t��,����,1997/5/9,���h�{���x�h��,�s�����Y,���p���Y,���h�{��,��t,�O��,�P���n�㎮,200mm,�l�W��,�b,�L,�L,,,,,,,,�W��,�s�L�n,���H�i�����j,�s�i�y�؁j,�����������ʐ�,1�N,�{�́E�����فE���̑��t�����i�i�W���j,1
59,152206,������2����41�ԕt��,����,2007/10/2,���h�{���x�h��,�s�����Y,���p���Y,���h�{��,�ݒu�i�Ζ���t���j,�k��,�P���n�㎮,150mm,�l�W��,�b,�L,�L,������]��,,,,,,,�W��,�s�L�n,���H�i�����j,�s�i�y�؁j,������3���ʐ�,1�N,�{�́E�����فE���̑��t�����i�i�W���j,1
61,208001,���ؒ�6�ԕt��,����,1972/6/14,���h�{���x�h��,�s�����Y,���p���Y,���h�{��,�ݒu�i��ʍ����j,,�n�����i���ٖ��j,100mm,�l�W��,�b,�L,��,,,,,,,,�W��,�s�L�n,���H�i�����j,�s�i�y�؁j,���ؒ����ʐ�,1�N,�{�́E�����فE���̑��t�����i�i�W���j,2
62,252102,������1����28�ԕt��,����,1989/10/1,���h�{���x�h��,�s�����Y,���p���Y,���h�{��,�ݒu�i��ʍ����j,,�n�����i���ٗL�j,75mm,�l�W��,��,��,��,,,,,,,,�W��,�s�L�n,���H�i�ԓ��j,�s�i�y�؁j,������1����15���ʐ�,1�N,�{�́E���̑��t�����i�i�W���j,2
63,423001,������27�Ԓn�t��,����,1975/9/22,���h�{���x�h��,�s�����Y,���p���Y,���h�{��,�ݒu�i��ʍ����j,,,,,,,,,�R���N���[�g��,40��,�L,��,��,1,�W��,�s�L�n,���H�i�ԓ��j,�s�i�y�؁j,��������1���ʐ�,1�N,�{�́E�����فE���̑��t�����i�i�W���j,4
64,907001,���쒬224��1���t��,����,1990/7/30,���h�{���x�h��,�s�����Y,���p���Y,���h�{��,�ڊ�,,,,,,,,,,48.6��,�L,��,,,�W��,,,,,,,9
65,340001,�y�G��43��3���t��,�r�D��,1977/3/28,���h�{���x�h��,�s�����Y,���p���Y,���h�{��,,,�n�����i���ٗL�j,100mm,�l�W��,��,��,��,,,,,,,,�W��,,���H�i�ԓ��j,,,,,3
66,349305,�{�֐���3����29�ԕt��,�r�D��,1996/7/16,���h�{���x�h��,�s�����Y,���p���Y,���h�{��,,,�n�����i���ٗL�j,150mm,�l�W��,��,��,��,,,,,,,,�W��,�s�L�n,���H�i�ԓ��j,,,,,3
67,352103,������1����13�ԕt��,�r�D��,1997/12/22,���h�{���x�h��,�s�����Y,���p���Y,���h�{��,,,�n�����i���ٗL�j,75mm,�l�W��,��,��,��,,,,,,,,�W��,,���H�i�����j,,,,,3
68,352501,������5����1�ԕt��,�r�D��,1991/1/1,���h�{���x�h��,�s�����Y,���p���Y,���h�{��,,,�n�����i���ٗL�j,150mm,�l�W��,��,��,��,,,,,,,,�W��,,,,,,,3
69,352203,������2����19�ԕt��,�r�D��,1985/11/13,���h�{���x�h��,�s�����Y,���p���Y,���h�{��,,,�n�����i���ٗL�j,150mm,�l�W��,��,��,��,,,,,,,,�W��,,���H�i�����j,,,,,3
70,352302,������3����20�ԕt��,�r�D��,1985/11/13,���h�{���x�h��,�s�����Y,���p���Y,���h�{��,,,�n�����i���ٖ��j,150mm,�l�W��,��,��,��,,,,,,,,�W��,���L�n,���H�i�����j,,,,,3
71,640001,�y�G��93�ԕt��,����,1970/10/27,���h�{���x�h��,�s�����Y,���p���Y,���h�{��,,�O��,�P���n�㎮,75mm,�l�W��,�b,��,��,,,,,,,,�W��,���L�n,���̑�,,,,,6
72,549404,�{�֐���4����15�ԕt��,���̑�,,���h�{���x�h��,�s�����Y,���p���Y,���h�{��,,,,,,,,,,,,,,,,,,,,,,,5
73,549403,�{�֐���4����15�ԕt��,���̑�,,���h�{���x�h��,�s�����Y,���p���Y,���h�{��,,,,,,,,,,,,,,,,,,,,,,,5
74,511201,�`�k��2����9�ԕt��,���̑�,,���h�{���x�h��,�s�����Y,���p���Y,���h�{��,,,,,,,,,,,,,,,,,,,,,,,5
75,103203,�G�ے�2����16�ԕt��,����,1998/2/9,���h�{���x�h��,�s�����Y,���p���Y,���h�{��,�ݒu�i��ʍ����j,�O��,�o���n�㎮,200mm,�l�W��,��,�L,�L,,,,,,,,�W��,�s�L�n,���H�i�����j,�s�i�y�؁j,�G�ے����ʐ�,1�N,�{�́E�����فE���̑��t�����i�i�W���j,1
76,103303,�G�ے�3����13��1���t��,����,1979/9/1,���h�{���x�h��,�s�����Y,���p���Y,���h�{��,��t,�O��,�o���n�㎮,150mm,�l�W��,C,�L,��,,,,,,,,�h���,�s�L�n,���H�i�H���j,�s�i�y�؁j,�G�ے�3����3���ʐ�,1�N,�{�́E�����فE���̑��t�����i�i�h���j,1
77,105204,��������2����17�ԕt��,����,2005/1/27,���h�{���x�h��,�s�����Y,���p���Y,���h�{��,��t,�k��,�o���n�㎮,100mm,�l�W��,C,�L,�L,������]��,,,,,,,,�s�L�n,���̑�,,,,,1
78,127002,�z�n��138�Ԓn,����,1967/10/12,���h�{���x�h��,�s�����Y,���p���Y,���h�{��,�ݒu�i��ʍ����j,�k�쎮,�o���n�㎮,150mm,�l�W��,C,�L,�L,������]��,,,,,,,,���L�n,���H�i�����j,���i�y���j,�����`��,5�N,�{��,1
79,127003,�z�n�����Ԓn,����,2002/3/8,���h�{���x�h��,�s�����Y,���p���Y,���h�{��,�ݒu�i��ʍ����j,�k��,�P���n�㎮,100mm,�l�W��,C,�L,�L,������]��,,,,,,,�W��,�s�L�n,���H�i�����j,�s�i�y�؁j,��������1����9���ʐ�,1�N,�{�́E�����فE���̑��t�����i�i�W���j,1
80,127008,�z�n��89�Ԓn33���t��,����,1999/10/12,���h�{���x�h��,�s�����Y,���p���Y,���h�{��,��t,�k��,�P���n�㎮,300mm,�l�W��,C,�L,��,,,,,,,,�W��,���L�n,���H�i�����j,���i�y���j,�����`��,5�N,�{�́E�����فE���̑��t�����i�i�W���j,1
81,133003,�����H��11�ԕt��,����,2009/7/14,���h�{���x�h��,�s�����Y,���p���Y,���h�{��,��ʍ���,�k��,�P���n�㎮,100mm,�l�W��,C,�L,�L,������]��,,,,,,,�W��,�s�L�n,���H�i�����j,�s�i�y�؁j,�򒬒ʐ�,1�N,�{�́E�����فE���̑��t�����i�i�W���j,1
82,133002,�����H��17��4���t��,����,1970/8/26,���h�{���x�h��,�s�����Y,���p���Y,���h�{��,�ݒu�i��ʍ����j,�k��,�o���n�㎮,150mm,�l�W��,C,�L,�L,������]��,,,,,,,�W���E�h���,�s�L�n,���H�i�H���j,�s�i�y�؁j,�򒬒ʐ�,1�N,�{�́E�����فE���̑��t�����i�i�W���E�h���j,1
83,117002,��22�ԕt��,����,2016/3/16,���h�{���x�h��,�s�����Y,���p���Y,���h�{��,�ݒu�i��ʍ����j,�k�쎮,�o���n�㎮,150mm,�l�W��,C,�L,�L,������]��,,,,,,,�W���E�h���i�|�[���j,�s�L�n,���H�i�H���j,�s�i�y�؁j,��4���ʐ�,1�N,�{�́E�����فE�h���i�|�[���j,1
84,142007,������2�ԕt��,����,2001/11/9,���h�{���x�h��,�s�����Y,���p���Y,���h�{��,�ݒu�i��ʍ����j,�O��,�P���n�㎮,150mm,�l�W��,C,�L,�L,,,,,,,,�W��,�s�L�n,���H�i�����j,�s�i�y�؁j,�������ʐ�,1�N,�{�́E�����فE���̑��t�����i�i�W���j,1
85,142004,������2��13���t��,����,1995/12/21,���h�{���x�h��,�s�����Y,���p���Y,���h�{��,�ݒu�i�Ζ���t���j,�O��,�o���n�㎮,150mm,�l�W��,C,�L,�L,,,,,,,,�W��,�s�L�n,���H�i�����j,�s�i�y�؁j,�������ʐ�,1�N,�{�́E�����فE���̑��t�����i�i�W���j,1
86,142001,������14��19���t��,����,2005/10/6,���h�{���x�h��,�s�����Y,���p���Y,���h�{��,�ݒu�i��ʍ����j,�k��,�P���n�㎮,150mm,�l�W��,C,�L,�L,������]��,,,,,,,�W��,�s�L�n,���H�i�����j,�s�i�y�؁j,�������ʐ�,1�N,�{�́E�����فE���̑��t�����i�i�W���j,1
87,106101,�C�ݒ�1����20��30���t��,����,2006/4/10,���h�{���x�h��,�s�����Y,���p���Y,���h�{��,�ݒu�i��ʍ����j,�k��,�o���n�㎮,350mm,�l�W��,C,�L,�L,������]��,,,,,,,,�s�L�n,�����{�ݕ~�n��,,,,,1
88,106102,�C�ݒ�1����4�ԕt��,����,2009/2/24,���h�{���x�h��,�s�����Y,���p���Y,���h�{��,��t,�k��,�o���n�㎮,100mm,�l�W��,C,�L,�L,������]��,,,,,,,�W��,�s�L�n,���H�i�����j,�s�i�y�؁j,���C���{�[�ʂ�,1�N,�{�́E�����فE���̑��t�����i�i�W���j,1
89,106205,�C�ݒ�2����4�ԕt��,����,2006/8/31,���h�{���x�h��,�s�����Y,���p���Y,���h�{��,�ݒu�i��ʍ����j,�k��,�P���n�㎮,100mm,�l�W��,C,�L,�L,������]��,,,,,,,�W��,�s�L�n,���H�i�����j,�s�i�y�؁j,�m�b�N�X�r���ʐ�,1�N,�{�́E�����فE���̑��t�����i�i�W���j,1
90,125307,������3����8�ԕt��,����,2008/12/22,���h�{���x�h��,�s�����Y,���p���Y,���h�{��,�ݒu�i��ʍ����j,�k��,�P���n�㎮,100mm,�l�W��,C,�L,�L,�l�I�����t�F�@  ������]��,,,,,,,�W��,�s�L�n,������,�s�i�����j,������������,5�N,�{�́E���̑��t�����i�i�W���j,1
91,125306,������3����5�ԕt��,����,1994/7/18,���h�{���x�h��,�s�����Y,���p���Y,���h�{��,�ݒu�i��ʍ����j,�k��,�o���n�㎮,200mm,�l�W��,C,�L,�L,������]��,,,,,,,�W��,�s�L�n,���H�i�����j,�s�i�y�؁j,�ǒ����`��,1�N,�{�́E�����فE���̑��t�����i�i�W���j,1
92,129003,��Ւ�12�ԕt��,����,1983/11/9,���h�{���x�h��,�s�����Y,���p���Y,���h�{��,�ݒu�i��ʍ����j,�O��,�P���n�㎮,100mm,�l�W��,C,�L,��,,,,,,,,�h���,�s�L�n,���H�i�ԓ��j,�s�i�y�؁j,��Ւ�2���ʐ�,1�N,�{�́E�����فE���̑��t�����i�i�h���j,1
93,114002,�K��6��23���t��,����,1997/10/30,���h�{���x�h��,�s�����Y,���p���Y,���h�{��,�ݒu�i��ʍ����j,���X,�o���n�㎮,150mm,�l�W��,C,�L,�L,�l�I�����t�F,,,,,,,�W��,�s�L�n,���H�i�����j,�s�i�y�؁j,�����Z���^�[�ʐ�,1�N,�{�́E�����فE���̑��t�����i�i�W���j,1
94,115202,�h��2����14��1���t��,����,2005/6/6,���h�{���x�h��,�s�����Y,���p���Y,���h�{��,�ݒu�i��ʍ����j,�k��,�o���n�㎮,150mm,�l�W��,C,�L,�L,������]��,,,,,,,�W��,���L�n,���H�i�����j,���i�y���j,��������,5�N,�{�́E�����فE���̑��t�����i�i�W���j,1
95,137102,�M����1����2�ԕt��,����,2006/10/31,���h�{���x�h��,�s�����Y,���p���Y,���h�{��,�ݒu�i��ʍ����j,�k��,�P���n�㎮,100mm,�l�W��,C,�L,�L,������]��,,,,,,,�W��,�s�L�n,���H�i�����j,�s�i�y�؁j,�M����2����2���ʐ�,1�N,�{�́E�����فE���̑��t�����i�i�W���j,1
96,137202,�M����2����6��14���t��,����,2011/9/22,���h�{���x�h��,�s�����Y,���p���Y,���h�{��,�ݒu�i��ʍ����j,�k��,�o���n�㎮,150mm,�l�W��,C,�L,��,������]��,,,,,,,�W��,�s�L�n,���H�i�����j,�s�i�y�؁j,�s�������E�M���ʐ�,1�N,�{�́E������,1
97,150301,�R�蒬3����10��10���t��,����,2004/1/29,���h�{���x�h��,�s�����Y,���p���Y,���h�{��,�ݒu�i�Ζ���t���j,�k��,�o���n�㎮,150mm,�l�W��,C,�L,�L,������]��,,,,,,,�W��,�s�L�n,���H�i�����j,�s�i�y�؁j,�R�蒬�ʐ�,1�N,�{�́E�����فE���̑��t�����i�i�W���j,1
98,120105,�V�x��1����14�ԕt��,����,,���h�{���x�h��,�s�����Y,���p���Y,���h�{��,�ݒu�i��ʍ����j,�O��,�P���n�㎮,150mm,�l�W��,C,�L,��,,,,,,,,,�s�L�n,���H�i�H���j,�s�i�y�؁j,,1�N,�{�́E������,1
99,120102,�V�x��1����2�ԕt��,����,1997/11/20,���h�{���x�h��,�s�����Y,���p���Y,���h�{��,�ڊ�,�O��,�P���n�㎮,150mm,�l�W��,C,�L,�L,,,,,,,,,�s�L�n,���H�i�����j,�s�i�y�؁j,�V�x���ʐ�,1�N,�{�́E������,1
100,124003,���Ò��t��,����,1975/4/1,���h�{���x�h��,�s�����Y,���p���Y,���h�{��,�ڊ�,����,�o���n�㎮,100mm,�l�W��,C,��,��,,,,,,,,,���L�n,���̑�,,,,,1
101,124001,���Ò��t��,����,1993/6/16,���h�{���x�h��,�s�����Y,���p���Y,���h�{��,�ڊ�,�O��,�P���n�㎮,100mm,�l�W��,C,�L,��,,,,,,,,,���L�n,���̑�,,,,,1
102,124004,���Ò��t��,����,2008/3/25,���h�{���x�h��,�s�����Y,���p���Y,���h�{��,�ݒu�i��ʍ����j,�k��,�P���n�㎮,100mm,�l�W��,C,�L,�L,������]��,,,,,,,�W��,�s�L�n,���H�i�����j,,,,,1
103,124005,���Ò��t��,����,2010/10/27,���h�{���x�h��,�s�����Y,���p���Y,���h�{��,�ڊ�,�k��,�o���n�㎮,150mm,�l�W��,C,�L,�L,������]��,,,,,,,�W��,�s�L�n,���̑�,���̑�,���]�Ս`���H,,�{�́E�����فE���̑��t�����i�i�W���j,1
104,124002,���Ò��t��,����,1983/7/1,���h�{���x�h��,�s�����Y,���p���Y,���h�{��,�ڊ�,�O��,�P���n�㎮,100mm,�l�W��,C,�L,��,,,,,,,,,���L�n,���H�i�H���j,,,,,1
105,138102,����k��1����10�ԕt��,����,2001/7/13,���h�{���x�h��,�s�����Y,���p���Y,���h�{��,�ݒu�i��ʍ����j,�k��,�P���n�㎮,100mm,�l�W��,C,�L,�L,,,,,,,,�W��,�s�L�n,���H�i�H���j,�s�i�y�؁j,����k��1����3��ʐ�,1�N,�{�́E�����فE���̑��t�����i�i�W���j,1
106,138103,����k��1����16�ԕt��,����,2001/1/25,���h�{���x�h��,�s�����Y,���p���Y,���h�{��,�ݒu�i�Ζ���t���j,�k��,�o���n�㎮,300mm,�l�W��,C,�L,�L,������]��,,,,,,,�W��,�s�L�n,���H�i�����j,�s�i�y�؁j,��������ʐ�,1�N,�{�́E�����فE���̑��t�����i�i�W���j,1
107,139209,����쒬2����62��78�t��,����,,���h�{���x�h��,�s�����Y,���p���Y,���h�{��,�ݒu�i��ʍ����j,�k��,�P���n�㎮,100mm,�l�W��,C,�L,�L,������]��,,,,,,,�W��,�s�L�n,���H�i�H���j,�s�i�y�؁j,����쒬2����11���ʐ�,1�N,�{�́E�����فE���̑��t�����i�i�W���j,1
108,139311,����쒬3����48��135���t��,����,1974/11/1,���h�{���x�h��,�s�����Y,���p���Y,���h�{��,�ݒu�i��ʍ����j,�O��,�P���n�㎮,100mm,�l�W��,C,�L,��,,,,,,,,,�s�L�n,���H�i�H���j,�s�i�y�؁j,����쒬3����11���ʐ�,1�N,�{�́E������,1
109,139401,����쒬4����1�ԕt��,����,1979/3/9,���h�{���x�h��,�s�����Y,���p���Y,���h�{��,�ݒu�i��ʍ����j,�k��,�P���n�㎮,100mm,�l�W��,C,�L,�L,,,,,,,,�W��,�s�L�n,���H�i�H���j,�s�i�y�؁j,����k��2����2��ʐ�,1�N,�{�́E�����فE���̑��t�����i�i�W���j,1
110,139502,����쒬5����8��9���t��,����,1974/5/10,���h�{���x�h��,�s�����Y,���p���Y,���h�{��,�ݒu�i��ʍ����j,�O��,�o���n�㎮,150mm,�l�W��,C,�L,��,,,,,,,,,�s�L�n,���H�i�H���j,�s�i�y�؁j,����k��2����2��ʐ�,1�N,�{�́E������,1
111,139505,����쒬5����9��4���t��,����,2009/11/10,���h�{���x�h��,�s�����Y,���p���Y,���h�{��,�ݒu�i��ʍ����j,�k��,�P���n�㎮,100mm,�l�W��,C,�L,�L,������]��,,,,,,,�W��,�s�L�n,���H�i�H���j,�s�i�y�؁j,����쒬2����1��ʐ�,1�N,�{�́E�����فE���̑��t�����i�i�W���j,1
112,139102,����쒬1����7�ԕt��,����,2009/1/29,���h�{���x�h��,�s�����Y,���p���Y,���h�{��,�ݒu�i��ʍ����j,�k��,�P���n�㎮,100mm,�l�W��,C,�L,�L,������]��,,,,,,,�W��,�s�L�n,���H�i�����j,�s�i�y�؁j,����쒬2����1��ʐ�,1�N,�{�́E�����فE���̑��t�����i�i�W���j,1
113,203203,�G�ے�2����17��21���t��,����,1988/12/28,���h�{���x�h��,�s�����Y,���p���Y,���h�{��,�ݒu�i�Ζ���t���j,,�n�����i���ٖ��j,150mm,�l�W��,��,�L,��,,,,,,,,�W��,�s�L�n,���H�i�ԓ��j,�s�i�y�؁j,�G�ے�2����25���ʐ�,1�N,�{�́E�����فE���̑��t�����i�i�W���j,2
114,242001,������4�ԕt��,����,2002/12/24,���h�{���x�h��,�s�����Y,���p���Y,���h�{��,�ݒu�i��ʍ����j,,�n�����i���ٗL�j,75mm,�l�W��,��,��,��,,,,,,,,,�s�L�n,���H�i�ԓ��j,�s�i�y�؁j,������2���ʐ�,1�N,�{��,2
115,206203,�C�ݒ�2����6��3���t��,����,1969/1/1,���h�{���x�h��,�s�����Y,���p���Y,���h�{��,�ݒu�i��ʍ����j,,�n�����i���ٖ��j,150mm,�l�W��,��,��,��,,,,,,,,�W��,�s�L�n,���H�i�����j,�s�i�y�؁j,���������ʐ�,1�N,�{�́E���̑��t�����i�i�W���j,2
116,235306,����3����(�H�ƒc�n )�t��,����,2001/3/1,���h�{���x�h��,�s�����Y,���p���Y,���h�{��,�ݒu�i��ʍ����j,,�n�����i���ٗL�j,150mm,�l�W��,��,��,��,,,,,,,,�W��,�s�L�n,���H�i�ԓ��j,�s�i�y�؁j,�C�^���L�C�������,1�N,�{�́E���̑��t�����i�i�W���j,2